BDBM50345252 5-bromo-7-(2-(pyridin-4-yl)ethoxy)benzofuran-2-carboxylic acid::CHEMBL1782523
SMILES OC(=O)c1cc2cc(Br)cc(OCCc3ccncc3)c2o1
InChI Key InChIKey=JXSSCPMIHVAWFG-UHFFFAOYSA-N
Data  2 IC50
  Tab Delimited (TSV)   2D SDfile   Computed 3D by Vconf -m prep SDfile
Find this compound or compounds like it in BindingDB:
Activity Spreadsheet -- Enzyme Inhibition Constant Data from BindingDB
Found 2 hits for monomerid = 50345252
TargetSerine/threonine-protein kinase pim-2(Homo sapiens (Human))
Genzyme
Curated by ChEMBL
LigandPNGBDBM50345252(5-bromo-7-(2-(pyridin-4-yl)ethoxy)benzofuran-2-car...)
Affinity DataIC50:  2.11E+4nM. Assay description: Inhibition of human Pim2 using 5-FAM-RSRHSSYPAGT-CONH2 as substrate after 90 mins by off-chip mobility shift method
In DepthDetails ArticlePubMed
TargetSerine/threonine-protein kinase pim-1(Homo sapiens (Human))
Genzyme
Curated by ChEMBL
LigandPNGBDBM50345252(5-bromo-7-(2-(pyridin-4-yl)ethoxy)benzofuran-2-car...)
Affinity DataIC50:  4.50E+3nM. Assay description: Inhibition of human Pim1 using 5-FAM-RSRHSSYPAGT-CONH2 as substrate after 45 mins by off-chip mobility shift method
In DepthDetails ArticlePubMed