BDBM50345635 (S)-2-acetamido-3-((S)-2-((2S,3R)-1-((S)-1-amino-3-(4-hydroxyphenyl)-1-oxopropan-2-ylamino)-3-hydroxy-1-oxobutan-2-ylcarbamoyl)pyrrolidin-1-yl)-3-oxopropyl dihydrogen phosphate::CHEMBL1784779
SMILES C[C@@H](O)[C@H](NC(=O)[C@@H]1CCCN1C(=O)[C@H](COP(O)(O)=O)NC(C)=O)C(=O)N[C@@H](Cc1ccc(O)cc1)C(N)=O
InChI Key InChIKey=WTGXUZBOJAWDBA-WYIQVNFWSA-N
Data  1 IC50
  Tab Delimited (TSV)   2D SDfile   Computed 3D by Vconf -m prep SDfile
Find this compound or compounds like it in BindingDB:
Activity Spreadsheet -- Enzyme Inhibition Constant Data from BindingDB
Found 1 hit for monomerid = 50345635
TargetBreast cancer type 1 susceptibility protein(Homo sapiens (Human))
University Of Nebraska Medical Center
Curated by ChEMBL
LigandPNGBDBM50345635((S)-2-acetamido-3-((S)-2-((2S,3R)-1-((S)-1-amino-3...)
Affinity DataIC50:  1.49E+4nM. Assay description: Inhibition of BRCA1 by fluorescence polarization assay
In DepthDetails ArticlePubMed