BDBM50345686 (3-endo)-1,1-Bis(5-fluoro-2-methylphenyl)-2-(8,8-dimethyl-8-azoniabicyclo[3.2.1]oct-3-yl)ethanol Bromide::CHEMBL1782100
SMILES Cc1ccc(F)cc1C(O)(CC1C[C@H]2CC[C@H](C1)[N+]2(C)C)c1cc(F)ccc1C
InChI Key InChIKey=LBKRXXLTIFHWRI-FGZHOGPDSA-N
Data  1 IC50
  Tab Delimited (TSV)   2D SDfile   Computed 3D by Vconf -m prep SDfile
Find this compound or compounds like it in BindingDB:
Activity Spreadsheet -- Enzyme Inhibition Constant Data from BindingDB
Found 1 hit for monomerid = 50345686
TargetMuscarinic acetylcholine receptor M3(Homo sapiens (Human))
Glaxosmithkline
Curated by ChEMBL
LigandPNGBDBM50345686((3-endo)-1,1-Bis(5-fluoro-2-methylphenyl)-2-(8,8-d...)
Affinity DataIC50:  37nM. Assay description: Antagonist activity against human M3 receptor expressed in CHO cells assessed as inhibition of acetylcholine-induced calcium mobilization by FLIPR
In DepthDetails ArticlePubMed