BDBM50345688 (3-endo)-1,1-Bis(3,4-difluorophenyl)-2-(8,8-dimethyl-8-azoniabicyclo[3.2.1]oct-3-yl)ethanol Bromide::CHEMBL1782102
SMILES C[N+]1(C)[C@@H]2CC[C@@H]1CC(CC(O)(c1ccc(F)c(F)c1)c1ccc(F)c(F)c1)C2
InChI Key InChIKey=RZKRJRKBQUAVOB-QZTJIDSGSA-N
Data  1 IC50
  Tab Delimited (TSV)   2D SDfile   Computed 3D by Vconf -m prep SDfile
Find this compound or compounds like it in BindingDB:
Activity Spreadsheet -- Enzyme Inhibition Constant Data from BindingDB
Found 1 hit for monomerid = 50345688
TargetMuscarinic acetylcholine receptor M3(Homo sapiens (Human))
Glaxosmithkline
Curated by ChEMBL
LigandPNGBDBM50345688((3-endo)-1,1-Bis(3,4-difluorophenyl)-2-(8,8-dimeth...)
Affinity DataIC50:  290nM. Assay description: Antagonist activity against human M3 receptor expressed in CHO cells assessed as inhibition of acetylcholine-induced calcium mobilization by FLIPR
In DepthDetails ArticlePubMed