BDBM50345800 CHEMBL1784978::ethyl 2-methoxy-6-(6-(tetrahydro-2H-pyran-2-yloxy)hexyl)benzoate
SMILES CCOC(=O)c1c(CCCCCCOC2CCCCO2)cccc1OC
InChI Key InChIKey=RKWQBRPKSHYGGR-UHFFFAOYSA-N
Data  1 IC50
  Tab Delimited (TSV)   2D SDfile   Computed 3D by Vconf -m prep SDfile
Find this compound or compounds like it in BindingDB:
Activity Spreadsheet -- Enzyme Inhibition Constant Data from BindingDB
Found 1 hit for monomerid = 50345800
TargetGlyceraldehyde-3-phosphate dehydrogenase, glycosomal(Trypanosoma cruzi)
Universidade Federal De S£O Carlos
Curated by ChEMBL
LigandPNGBDBM50345800(CHEMBL1784978 | ethyl 2-methoxy-6-(6-(tetrahydro-2...)
Affinity DataIC50: >2.50E+5nM. Assay description: Inhibition of Trypanosoma cruzi recombinant glycosomal GAPDH expressed in Escherichia coli using GAPDH and D-glyceraldehyde-3-phosphate
In DepthDetails ArticlePubMed