BDBM50345933 9-Allylamino-3-(4-chloro-phenyl)-3H-pyrido[3',2':4,5]thieno[3,2-d]pyrimidin-4-one::CHEMBL1783860
SMILES Clc1ccc(cc1)-n1cnc2c(sc3nccc(NCC=C)c23)c1=O
InChI Key InChIKey=WVUUYUBPRJLORS-UHFFFAOYSA-N
Data  1 KI  2 IC50
  Tab Delimited (TSV)   2D SDfile   Computed 3D by Vconf -m prep SDfile
Find this compound or compounds like it in BindingDB:
Activity Spreadsheet -- Enzyme Inhibition Constant Data from BindingDB
Found 3 hits for monomerid = 50345933
TargetMetabotropic glutamate receptor 1(RAT)
Schering-Plough Research Institute
Curated by ChEMBL
LigandPNGBDBM50345933(9-Allylamino-3-(4-chloro-phenyl)-3H-pyrido[3',2':4...)
Affinity DataKi:  1.10nM. Assay description: Antagonist activity at rat mGluR1
In DepthDetails ArticlePubMed
TargetMetabotropic glutamate receptor 1(Homo sapiens (Human))
Schering-Plough Research Institute
Curated by ChEMBL
LigandPNGBDBM50345933(9-Allylamino-3-(4-chloro-phenyl)-3H-pyrido[3',2':4...)
Affinity DataIC50:  60nM. Assay description: Antagonist activity at human mGluR1
In DepthDetails ArticlePubMed
TargetMetabotropic glutamate receptor 5(Homo sapiens (Human))
Schering-Plough Research Institute
Curated by ChEMBL
LigandPNGBDBM50345933(9-Allylamino-3-(4-chloro-phenyl)-3H-pyrido[3',2':4...)
Affinity DataIC50: >3.00E+3nM. Assay description: Antagonist activity at human mGluR5
In DepthDetails ArticlePubMed