BDBM50346107 4-(5-allyl-6-methyl-2-(pyrazin-2-yl)pyrimidin-4-ylamino)benzoic acid::CHEMBL1782293
SMILES Cc1nc(nc(Nc2ccc(cc2)C(O)=O)c1CC=C)-c1cnccn1
InChI Key InChIKey=SIBPGAJIJPREGJ-UHFFFAOYSA-N
Data  2 IC50
  Tab Delimited (TSV)   2D SDfile   Computed 3D by Vconf -m prep SDfile
Find this compound or compounds like it in BindingDB:
Activity Spreadsheet -- Enzyme Inhibition Constant Data from BindingDB
Found 2 hits for monomerid = 50346107
TargetcAMP-specific 3',5'-cyclic phosphodiesterase 4D(Homo sapiens (Human))
Asahi Kasei Pharma
Curated by ChEMBL
LigandPNGBDBM50346107(4-(5-allyl-6-methyl-2-(pyrazin-2-yl)pyrimidin-4-yl...)
Affinity DataIC50:  3.00E+3nM. Assay description: Inhibition of human PDE4D3 incubated for 10 mins using cAMP and [3H]cAMP substrates
In DepthDetails ArticlePubMed
TargetcAMP-specific 3',5'-cyclic phosphodiesterase 4B(Homo sapiens (Human))
Asahi Kasei Pharma
Curated by ChEMBL
LigandPNGBDBM50346107(4-(5-allyl-6-methyl-2-(pyrazin-2-yl)pyrimidin-4-yl...)
Affinity DataIC50:  860nM. Assay description: Inhibition of human PDE4B1 incubated for 10 mins using cAMP and [3H]cAMP substrates
In DepthDetails ArticlePubMed