BDBM50346118 2-(4-(5-allyl-2-(5-methoxythiophen-2-yl)-6-methylpyrimidin-4-ylamino)phenyl)acetic acid::CHEMBL1782303
SMILES COc1ccc(s1)-c1nc(C)c(CC=C)c(Nc2ccc(CC(O)=O)cc2)n1
InChI Key InChIKey=ZMAUDELELCYNKX-UHFFFAOYSA-N
Data  2 IC50
  Tab Delimited (TSV)   2D SDfile   Computed 3D by Vconf -m prep SDfile
Find this compound or compounds like it in BindingDB:
Activity Spreadsheet -- Enzyme Inhibition Constant Data from BindingDB
Found 2 hits for monomerid = 50346118
TargetcAMP-specific 3',5'-cyclic phosphodiesterase 4D(Homo sapiens (Human))
Asahi Kasei Pharma
Curated by ChEMBL
LigandPNGBDBM50346118(2-(4-(5-allyl-2-(5-methoxythiophen-2-yl)-6-methylp...)
Affinity DataIC50:  5.30E+3nM. Assay description: Inhibition of human PDE4D3 incubated for 10 mins using cAMP and [3H]cAMP substrates
In DepthDetails ArticlePubMed
TargetcAMP-specific 3',5'-cyclic phosphodiesterase 4B(Homo sapiens (Human))
Asahi Kasei Pharma
Curated by ChEMBL
LigandPNGBDBM50346118(2-(4-(5-allyl-2-(5-methoxythiophen-2-yl)-6-methylp...)
Affinity DataIC50:  190nM. Assay description: Inhibition of human PDE4B1 incubated for 10 mins using cAMP and [3H]cAMP substrates
In DepthDetails ArticlePubMed