BDBM50347276 CHEMBL1796126
SMILES Clc1ccc(CN2c3cc(ccc3S(=O)(=O)c3ccccc3C2=O)C(=O)NCCCN2CCCC2)cc1
InChI Key InChIKey=RKOSERSRNKFCCZ-UHFFFAOYSA-N
Data  1 IC50
  Tab Delimited (TSV)   2D SDfile   Computed 3D by Vconf -m prep SDfile
Find this compound or compounds like it in BindingDB:
Activity Spreadsheet -- Enzyme Inhibition Constant Data from BindingDB
Found 1 hit for monomerid = 50347276
TargetL-cysteine:1D-myo-inositol 2-amino-2-deoxy-alpha-D-glucopyranoside ligase(Mycobacterium tuberculosis)
University Of California
Curated by ChEMBL
LigandPNGBDBM50347276(CHEMBL1796126)
Affinity DataIC50:  2.50E+5nM. Assay description: Inhibition of Mycobacterium tuberculosis recombinant MshC assessed as production of Cys-GlcN-Ins from cysteine by HPLC based fluorescence assay
In DepthDetails ArticlePubMed