BDBM50347465 CHEMBL1802185
SMILES OC[C@H]1O[C@H](Oc2ccc(cc2Cl)-c2ccc(cc2)C([O-])=O)[C@@H](O)[C@@H](O)[C@@H]1O
InChI Key InChIKey=GRWYYZUQOKZFOB-GJGATLCTSA-M
Data  2 IC50
  Tab Delimited (TSV)   2D SDfile   Computed 3D by Vconf -m prep SDfile
Find this compound or compounds like it in BindingDB:
Activity Spreadsheet -- Enzyme Inhibition Constant Data from BindingDB
Found 2 hits for monomerid = 50347465
TargetType 1 fimbrin D-mannose specific adhesin(Escherichia coli (strain K12))
University Of Basel
Curated by ChEMBL
LigandPNGBDBM50347465(CHEMBL1802185)
Affinity DataIC50:  6.70nM. Assay description: Competitive inhibition of His-tagged FimH carbohydrate recognizing domain expressed in Escherichia coli HM125 using ABTS-substrate after 3 hrs by cal...
In DepthDetails ArticlePubMed
TargetType 1 fimbiral adhesin FimH(Escherichia coli (strain UTI89 / UPEC))
University Of Basel
Curated by ChEMBL
LigandPNGBDBM50347465(CHEMBL1802185)
Affinity DataIC50:  1.00E+4nM. Assay description: Antagonist activity at Escherichia coli UT189 FimH in guinea pig red blood cells assessed as disaggregation of bacteria after 600 secs by aggregometr...
In DepthDetails ArticlePubMed