BDBM50348752 CHEMBL1807150
SMILES CSCC[C@H](NC(=O)[C@H](Cc1c[nH]c2ccccc12)NC(=O)CNC(=O)[C@H](Cc1ccc(O)cc1)NC(=O)[C@H](C)NCCOCCOCCOCCOCCOCCOC(=O)CN1CCN(CC(O)=O)CCN(CC(O)=O)CCN(CC(O)=O)CC1)C(=O)N[C@@H](CC(O)=O)C(=O)N[C@@H](Cc1ccccc1)C(N)=O
InChI Key InChIKey=OQMZFBQXIDIBPR-RZYDYOCSSA-N
Data  2 IC50  1 EC50
  Tab Delimited (TSV)   2D SDfile   Computed 3D by Vconf -m prep SDfile
Find this compound or compounds like it in BindingDB:
Activity Spreadsheet -- Enzyme Inhibition Constant Data from BindingDB
Found 3 hits for monomerid = 50348752
TargetGastrin/cholecystokinin type B receptor(Homo sapiens (Human))
University Medical Centre Ljubljana
Curated by ChEMBL
LigandPNGBDBM50348752(CHEMBL1807150)
Affinity DataIC50:  2.5nM. Assay description: Displacement of [125I]CCK from gastrin receptor isolated from human tumor tissues
In DepthDetails ArticlePubMed
TargetCholecystokinin receptor type A(Homo sapiens (Human))
University Medical Centre Ljubljana
Curated by ChEMBL
LigandPNGBDBM50348752(CHEMBL1807150)
Affinity DataIC50: >700nM. Assay description: Displacement of [125I]CCK from CCK1 receptor isolated from human tumor tissues
In DepthDetails ArticlePubMed
TargetGastrin/cholecystokinin type B receptor(RAT)
University Medical Centre Ljubljana
Curated by ChEMBL
LigandPNGBDBM50348752(CHEMBL1807150)
Affinity DataEC50:  0.330nM. Assay description: Agonist activity at gastrin receptor in rat AR4-2J cells assessed as intracellular calcium mobilization by fluorescence assay
In DepthDetails ArticlePubMed