BDBM50348940 CHEMBL1807760
SMILES CCOC(=O)C=Cc1c(Oc2ccc(C)cc2)nc[nH]c1=O
InChI Key InChIKey=PADARNAVOBRVOT-UHFFFAOYSA-N
Data  3 IC50
  Tab Delimited (TSV)   2D SDfile   Computed 3D by Vconf -m prep SDfile
Find this compound or compounds like it in BindingDB:
Activity Spreadsheet -- Enzyme Inhibition Constant Data from BindingDB
Found 3 hits for monomerid = 50348940
TargetInsulin receptor(Homo sapiens (Human))
St. Jude Children'S Research Hospital
Curated by ChEMBL
LigandPNGBDBM50348940(CHEMBL1807760)
Affinity DataIC50: >4.00E+4nM. Assay description: Inhibition of recombinant IRK using biotinylated-poly(GT) peptide as substrate after 60 mins
In DepthDetails ArticlePubMed
TargetHepatocyte growth factor receptor(Homo sapiens (Human))
St. Jude Children'S Research Hospital
Curated by ChEMBL
LigandPNGBDBM50348940(CHEMBL1807760)
Affinity DataIC50: >4.00E+4nM. Assay description: Inhibition of recombinant MET using biotinylated-poly(GT) peptide as substrate after 60 mins
In DepthDetails ArticlePubMed
TargetALK tyrosine kinase receptor(Homo sapiens (Human))
St. Jude Children'S Research Hospital
Curated by ChEMBL
LigandPNGBDBM50348940(CHEMBL1807760)
Affinity DataIC50: >4.00E+4nM. Assay description: Inhibition of 6xHis-tagged NPM-ALK using biotinylated-poly(GT) peptide as substrate after 60 mins
In DepthDetails ArticlePubMed