BDBM50348945 CHEMBL1807757
SMILES COC(=O)c1cccc(Oc2nc[nH]c(=O)c2C=CC(C)=O)c1
InChI Key InChIKey=OHJCNWPGNDINQX-UHFFFAOYSA-N
Data  3 IC50
  Tab Delimited (TSV)   2D SDfile   Computed 3D by Vconf -m prep SDfile
Find this compound or compounds like it in BindingDB:
Activity Spreadsheet -- Enzyme Inhibition Constant Data from BindingDB
Found 3 hits for monomerid = 50348945
TargetInsulin receptor(Homo sapiens (Human))
St. Jude Children'S Research Hospital
Curated by ChEMBL
LigandPNGBDBM50348945(CHEMBL1807757)
Affinity DataIC50: >4.00E+4nM. Assay description: Inhibition of recombinant IRK using biotinylated-poly(GT) peptide as substrate after 60 mins
In DepthDetails ArticlePubMed
TargetHepatocyte growth factor receptor(Homo sapiens (Human))
St. Jude Children'S Research Hospital
Curated by ChEMBL
LigandPNGBDBM50348945(CHEMBL1807757)
Affinity DataIC50:  4.01E+3nM. Assay description: Inhibition of recombinant MET using biotinylated-poly(GT) peptide as substrate after 60 mins
In DepthDetails ArticlePubMed
TargetALK tyrosine kinase receptor(Homo sapiens (Human))
St. Jude Children'S Research Hospital
Curated by ChEMBL
LigandPNGBDBM50348945(CHEMBL1807757)
Affinity DataIC50:  3.03E+3nM. Assay description: Inhibition of 6xHis-tagged NPM-ALK using biotinylated-poly(GT) peptide as substrate after 60 mins
In DepthDetails ArticlePubMed