BDBM50348960 CHEMBL1808097
SMILES COc1cc(Oc2nc[nH]c(=O)c2C=CC(C)=O)c(cc1OC)C(C)=O
InChI Key InChIKey=MDESGINMMFGHJL-UHFFFAOYSA-N
Data  3 IC50
  Tab Delimited (TSV)   2D SDfile   Computed 3D by Vconf -m prep SDfile
Find this compound or compounds like it in BindingDB:
Activity Spreadsheet -- Enzyme Inhibition Constant Data from BindingDB
Found 3 hits for monomerid = 50348960
TargetALK tyrosine kinase receptor(Homo sapiens (Human))
St. Jude Children'S Research Hospital
Curated by ChEMBL
LigandPNGBDBM50348960(CHEMBL1808097)
Affinity DataIC50:  7.54E+3nM. Assay description: Inhibition of 6xHis-tagged NPM-ALK using biotinylated-poly(GT) peptide as substrate after 60 mins
In DepthDetails ArticlePubMed
TargetHepatocyte growth factor receptor(Homo sapiens (Human))
St. Jude Children'S Research Hospital
Curated by ChEMBL
LigandPNGBDBM50348960(CHEMBL1808097)
Affinity DataIC50: >4.00E+4nM. Assay description: Inhibition of recombinant MET using biotinylated-poly(GT) peptide as substrate after 60 mins
In DepthDetails ArticlePubMed
TargetInsulin receptor(Homo sapiens (Human))
St. Jude Children'S Research Hospital
Curated by ChEMBL
LigandPNGBDBM50348960(CHEMBL1808097)
Affinity DataIC50: >4.00E+4nM. Assay description: Inhibition of recombinant IRK using biotinylated-poly(GT) peptide as substrate after 60 mins
In DepthDetails ArticlePubMed