BDBM50349735 CHEMBL1809162::US8822447, 23::US9771375, Example 23
SMILES CSc1nn(-c2ccccc2)c2cc(ccc12)N1CCN(CC1)C1CCNCC1
InChI Key InChIKey=WEKPXLRLBNJBOA-UHFFFAOYSA-N
Data  3 IC50
  Tab Delimited (TSV)   2D SDfile   Computed 3D by Vconf -m prep SDfile
Find this compound or compounds like it in BindingDB:
Activity Spreadsheet -- Enzyme Inhibition Constant Data from BindingDB
Found 2 hits for monomerid = 50349735
TargetKetohexokinase(Homo sapiens (Human))
Janssen Pharmaceutica
US Patent
LigandPNGBDBM50349735(CHEMBL1809162 | US8822447, 23 | US9771375, Example...)
Affinity DataIC50:  680nMT: 2°C. Assay description: An enzymatic assay was developed to measure KHK-mediated conversion of D-fructose to Fructose-1-P (F-1-P) using High Throughput Mass Spectroscopy (HT...
In DepthDetails US Patent
TargetKetohexokinase(Homo sapiens (Human))
Janssen Pharmaceutica
US Patent
LigandPNGBDBM50349735(CHEMBL1809162 | US8822447, 23 | US9771375, Example...)
Affinity DataIC50:  680nM. Assay description: An enzymatic assay was developed to measure KHK-mediated conversion of D-fructose to Fructose-1-P (F-1-P) using High Throughput Mass Spectroscopy (HT...
In DepthDetails US Patent