BDBM50351176 CHEMBL1818126
SMILES CCOc1ccc(cc1-c1ccc2c(N)nc(N)nc2c1)-c1cccnc1
InChI Key InChIKey=MDSKHVBXATUZID-UHFFFAOYSA-N
Data  2 KI
  Tab Delimited (TSV)   2D SDfile   Computed 3D by Vconf -m prep SDfile
Find this compound or compounds like it in BindingDB:
Activity Spreadsheet -- Enzyme Inhibition Constant Data from BindingDB
Found 2 hits for monomerid = 50351176
TargetDihydrofolate reductase(Staphylococcus aureus)
Trius Therapeutics, San Diego, Ca 92121, United States.
Curated by ChEMBL
LigandPNGBDBM50351176(CHEMBL1818126)
Affinity DataKi:  0.300nM. Assay description: Inhibition of Staphylococcus aureus DHFR assessed as oxidation of NADPH using dihydrofolate as substrate pre-incubated for 10 mins before substrate a...
In DepthDetails ArticlePubMed
TargetDihydrofolate reductase(Homo sapiens (Human))
Trius Therapeutics, San Diego, Ca 92121, United States.
Curated by ChEMBL
LigandPNGBDBM50351176(CHEMBL1818126)
Affinity DataKi:  10.1nM. Assay description: Inhibition of human DHFR assessed as oxidation of NADPH using dihydrofolate as substrate pre-incubated for 10 mins before substrate addition by spect...
In DepthDetails ArticlePubMed