BDBM50351346 CHEMBL1818919
SMILES CC(=O)NC(CC(=O)c1ccc2ccccc2c1)c1cccc(Br)c1
InChI Key InChIKey=LDCVOUABGXBNQW-UHFFFAOYSA-N
Data  1 IC50
  Tab Delimited (TSV)   2D SDfile   Computed 3D by Vconf -m prep SDfile
Find this compound or compounds like it in BindingDB:
Activity Spreadsheet -- Enzyme Inhibition Constant Data from BindingDB
Found 1 hit for monomerid = 50351346
TargetXanthine dehydrogenase/oxidase(Bos taurus (Bovine))
Indo-Soviet Friendship College Of Pharmacy
Curated by ChEMBL
LigandPNGBDBM50351346(CHEMBL1818919)
Affinity DataIC50:  2.45E+3nM. Assay description: Inhibition of bovine milk xanthine oxidase assessed as decrease of uric acid formation preincubated for 5 mins by UV-visible spectrophotometric analy...
In DepthDetails ArticlePubMed