BDBM50351351 CHEMBL1818924
SMILES CC(=O)NC(CC(=O)c1ccc(cc1)[N+]([O-])=O)c1ccc(Cl)cc1
InChI Key InChIKey=VTLXSBKCENFQME-UHFFFAOYSA-N
Data  1 IC50
  Tab Delimited (TSV)   2D SDfile   Computed 3D by Vconf -m prep SDfile
Find this compound or compounds like it in BindingDB:
Activity Spreadsheet -- Enzyme Inhibition Constant Data from BindingDB
Found 1 hit for monomerid = 50351351
TargetXanthine dehydrogenase/oxidase(Bos taurus (Bovine))
Indo-Soviet Friendship College Of Pharmacy
Curated by ChEMBL
LigandPNGBDBM50351351(CHEMBL1818924)
Affinity DataIC50:  4.54E+4nM. Assay description: Inhibition of bovine milk xanthine oxidase assessed as decrease of uric acid formation preincubated for 5 mins by UV-visible spectrophotometric analy...
In DepthDetails ArticlePubMed