BDBM50351357 CHEMBL1818930
SMILES CC(=O)NC(CC(=O)c1cccc(NC(C)=O)c1)c1cccc(c1)[N+]([O-])=O
InChI Key InChIKey=DMADSIZVXMZOKI-UHFFFAOYSA-N
Data  1 IC50
  Tab Delimited (TSV)   2D SDfile   Computed 3D by Vconf -m prep SDfile
Find this compound or compounds like it in BindingDB:
Activity Spreadsheet -- Enzyme Inhibition Constant Data from BindingDB
Found 1 hit for monomerid = 50351357
TargetXanthine dehydrogenase/oxidase(Bos taurus (Bovine))
Indo-Soviet Friendship College Of Pharmacy
Curated by ChEMBL
LigandPNGBDBM50351357(CHEMBL1818930)
Affinity DataIC50:  3.20E+4nM. Assay description: Inhibition of bovine milk xanthine oxidase assessed as decrease of uric acid formation preincubated for 5 mins by UV-visible spectrophotometric analy...
In DepthDetails ArticlePubMed