BDBM50351972 CHEMBL1822394
SMILES O[C@H]1CN(CC[C@@H]1N1CCC(CC1)C(=O)c1ccc(F)cc1)C(=O)c1ccc(F)cc1
InChI Key InChIKey=AFUYLLPRKMAJEJ-VXKWHMMOSA-N
Data  2 KI
  Tab Delimited (TSV)   2D SDfile   Computed 3D by Vconf -m prep SDfile
Find this compound or compounds like it in BindingDB:
Activity Spreadsheet -- Enzyme Inhibition Constant Data from BindingDB
Found 2 hits for monomerid = 50351972
TargetSigma non-opioid intracellular receptor 1(Cavia porcellus (Guinea pig))
Washington University
Curated by ChEMBL
LigandPNGBDBM50351972(CHEMBL1822394)
Affinity DataKi:  3.14E+3nM. Assay description: Displacement of (+)-[3H]pentazocine from sigma 1 receptor in guinea pig brain membrane homogenates after 90 mins by liquid scintillation counting
In DepthDetails ArticlePubMed
TargetVesicular acetylcholine transporter(Homo sapiens (Human))
Washington University
Curated by ChEMBL
LigandPNGBDBM50351972(CHEMBL1822394)
Affinity DataKi:  3.60E+3nM. Assay description: Displacement of (-)-[3H]vesamicol from human VAChT expressed in rat PC12 A123.7 cells after 20 hrs
In DepthDetails ArticlePubMed