BDBM50352038 CHEMBL1823806
SMILES OC1=NC(=O)C(S1)=Cc1cc(Br)c(O)cc1Br
InChI Key InChIKey=ZMVCBQCYVIZCTF-UHFFFAOYSA-N
Data  1 IC50
  Tab Delimited (TSV)   2D SDfile   Computed 3D by Vconf -m prep SDfile
Find this compound or compounds like it in BindingDB:
Activity Spreadsheet -- Enzyme Inhibition Constant Data from BindingDB
Found 1 hit for monomerid = 50352038
TargetCDGSH iron-sulfur domain-containing protein 1(Homo sapiens (Human))
Northeast Ohio Medical University
Curated by ChEMBL
LigandPNGBDBM50352038(CHEMBL1823806)
Affinity DataIC50:  2.93E+3nM. Assay description: Displacement of [3H]-rosiglitazone from human recombinant C-terminal His-tagged cytosolic domain of mitoNEET (32-108) by scintillation proximity assa...
In DepthDetails ArticlePubMed