BDBM50353349 CHEMBL1831073
SMILES CCOC(=O)c1ccc2OC(c3ccc(Br)o3)c3n(c(-c4ccccc4)c4c3n(C)c(=O)n(C)c4=O)-c2c1
InChI Key InChIKey=IQTUORHYHHBSMV-UHFFFAOYSA-N
Data  2 IC50
  Tab Delimited (TSV)   2D SDfile   Computed 3D by Vconf -m prep SDfile
Find this compound or compounds like it in BindingDB:
Activity Spreadsheet -- Enzyme Inhibition Constant Data from BindingDB
Found 2 hits for monomerid = 50353349
TargetCystic fibrosis transmembrane conductance regulator(Homo sapiens (Human))
University Of California
Curated by ChEMBL
LigandPNGBDBM50353349(CHEMBL1831073)
Affinity DataIC50:  25nM. Assay description: Inhibition of human wild-type CFTR expressed in FRT cells assessed as inhibition of forskolin-induced short-circuit current by voltage clamp electrop...
In DepthDetails ArticlePubMed
TargetCystic fibrosis transmembrane conductance regulator(Homo sapiens (Human))
University Of California
Curated by ChEMBL
LigandPNGBDBM50353349(CHEMBL1831073)
Affinity DataIC50:  50nM. Assay description: Inhibition of human wild-type CFTR expressed in FRT cells coexpressing YFP-H148Q assessed as inhibition of cAMP agonist-induced iodide influx after 4...
In DepthDetails ArticlePubMed