BDBM50354279 CHEMBL1836603
SMILES CN(C)CCCN1C(c2ccc(C)cc2)c2cc(Cl)ccc2N=C1C
InChI Key InChIKey=RZVYHDCYMAMDJY-UHFFFAOYSA-N
Data  2 KI  1 IC50
PDB links: 1 PDB ID matches this monomer.
  Tab Delimited (TSV)   2D SDfile   Computed 3D by Vconf -m prep SDfile
Find this compound or compounds like it in BindingDB:
Activity Spreadsheet -- Enzyme Inhibition Constant Data from BindingDB
Found 3 hits for monomerid = 50354279
TargetTrypanothione reductase(Trypanosoma brucei brucei)
University Of Dundee
Curated by ChEMBL
LigandPNGBDBM50354279(CHEMBL1836603)
Affinity DataKi:  190nM. Assay description: Competitive inhibition of recombinant trypanothione reductase from Trypanosoma brucei brucei S427 by Lineweaver burk method
TargetTrypanothione reductase(Trypanosoma brucei brucei)
University Of Dundee
Curated by ChEMBL
LigandPNGBDBM50354279(CHEMBL1836603)
Affinity DataKi:  1.46E+3nM. Assay description: Mixed type inhibition of recombinant trypanothione reductase from Trypanosoma brucei brucei S427 by Lineweaver burk method
TargetTrypanothione reductase(Trypanosoma brucei brucei)
University Of Dundee
Curated by ChEMBL
LigandPNGBDBM50354279(CHEMBL1836603)
Affinity DataIC50:  230nM. Assay description: Inhibition of recombinant trypanothione reductase from Trypanosoma brucei brucei S427 by DTNB-coupled spectrophotometric assay