BDBM50354785 CHEMBL1834465
SMILES ONC(=O)c1cnc(Nc2nnc(o2)-c2ccc(O)cc2)nc1
InChI Key InChIKey=ILMDRDUBEVDKNE-UHFFFAOYSA-N
Data  1 IC50
  Tab Delimited (TSV)   2D SDfile   Computed 3D by Vconf -m prep SDfile
Find this compound or compounds like it in BindingDB:
Activity Spreadsheet -- Enzyme Inhibition Constant Data from BindingDB
Found 1 hit for monomerid = 50354785
TargetHistone deacetylase 1(Homo sapiens (Human))
Guru Ghasidas University
Curated by ChEMBL
LigandPNGBDBM50354785(CHEMBL1834465)
Affinity DataIC50:  17nM. Assay description: Inhibition of HDAC1 by fluorescent activity assay
In DepthDetails ArticlePubMed