BDBM50354802 CHEMBL1834482
SMILES CN(C)c1ccc(cc1)-c1nnc(Nc2ncc(cn2)C(=O)NO)s1
InChI Key InChIKey=SWGHXLSUVWIYAM-UHFFFAOYSA-N
Data  1 IC50
  Tab Delimited (TSV)   2D SDfile   Computed 3D by Vconf -m prep SDfile
Find this compound or compounds like it in BindingDB:
Activity Spreadsheet -- Enzyme Inhibition Constant Data from BindingDB
Found 1 hit for monomerid = 50354802
TargetHistone deacetylase 1(Homo sapiens (Human))
Guru Ghasidas University
Curated by ChEMBL
LigandPNGBDBM50354802(CHEMBL1834482)
Affinity DataIC50:  11nM. Assay description: Inhibition of HDAC1 by fluorescent activity assay
In DepthDetails ArticlePubMed