BDBM50355077 CHEMBL1835755
SMILES O=C(Cc1cccc(c1)C(=O)N[C@@H]1CCCc2cc(CN3CCCCC3)ccc12)c1ccccc1
InChI Key InChIKey=QWJNKDQOILOZTF-GDLZYMKVSA-N
Data  1 KI
  Tab Delimited (TSV)   2D SDfile   Computed 3D by Vconf -m prep SDfile
Find this compound or compounds like it in BindingDB:
Activity Spreadsheet -- Enzyme Inhibition Constant Data from BindingDB
Found 1 hit for monomerid = 50355077
TargetB1 bradykinin receptor(Homo sapiens (Human))
Amgen
Curated by ChEMBL
LigandPNGBDBM50355077(CHEMBL1835755)
Affinity DataKi:  311nM. Assay description: Antagonist activity at human B1 receptor
In DepthDetails ArticlePubMed