BDBM50355078 CHEMBL1835758
SMILES Cn1cc(-c2cccc(c2)C(=O)N[C@@H]2CCCc3cc(CN4CCCCC4)ccc23)c(=O)c2ccccc12
InChI Key InChIKey=MXYGHZCYIGWVQN-SSEXGKCCSA-N
Data  1 KI
  Tab Delimited (TSV)   2D SDfile   Computed 3D by Vconf -m prep SDfile
Find this compound or compounds like it in BindingDB:
Activity Spreadsheet -- Enzyme Inhibition Constant Data from BindingDB
Found 1 hit for monomerid = 50355078
TargetB1 bradykinin receptor(Homo sapiens (Human))
Amgen
Curated by ChEMBL
LigandPNGBDBM50355078(CHEMBL1835758)
Affinity DataKi:  331nM. Assay description: Antagonist activity at human B1 receptor
In DepthDetails ArticlePubMed