BDBM50355084 CHEMBL1835759
SMILES Cn1cc(-c2ccc(cc2)C(=O)N[C@@H]2CCCc3cc(CN4CCCCC4)ccc23)c(=O)c2ccccc12
InChI Key InChIKey=CQWDDWZXIZCQBL-SSEXGKCCSA-N
Data  1 KI
  Tab Delimited (TSV)   2D SDfile   Computed 3D by Vconf -m prep SDfile
Find this compound or compounds like it in BindingDB:
Activity Spreadsheet -- Enzyme Inhibition Constant Data from BindingDB
Found 1 hit for monomerid = 50355084
TargetB1 bradykinin receptor(Homo sapiens (Human))
Amgen
Curated by ChEMBL
LigandPNGBDBM50355084(CHEMBL1835759)
Affinity DataKi: >1.00E+4nM. Assay description: Antagonist activity at human B1 receptor
In DepthDetails ArticlePubMed