BDBM50356187 CHEMBL1269725
SMILES NC(=S)NN=Cc1cccc(Cl)c1
InChI Key InChIKey=IPKPBBJJLUBSAV-UHFFFAOYSA-N
Data  1 KI  3 IC50
  Tab Delimited (TSV)   2D SDfile   Computed 3D by Vconf -m prep SDfile
Find this compound or compounds like it in BindingDB:
Activity Spreadsheet -- Enzyme Inhibition Constant Data from BindingDB
Found 4 hits for monomerid = 50356187
TargetUrease(Canavalia ensiformis (Jack bean) (Horse bean))
Comsats Institute Of Information Technology
Curated by ChEMBL
LigandPNGBDBM50356187(CHEMBL1269725)
Affinity DataKi:  625nM. Assay description: Inhibition of jack bean urease assessed as ammonia production after 30 mins by indophenol method
In DepthDetails ArticlePubMed
TargetCruzipain(Trypanosoma cruzi)
Universidad De Buenos Aires
Curated by ChEMBL
LigandPNGBDBM50356187(CHEMBL1269725)
Affinity DataIC50:  1.05E+5nM. Assay description: Inhibition of epimastigote form of Trypanosoma cruzi Tulahuen 2 cruzain assessed as reduction in 7-amino-4-methylcoumarin release incubated for 20 mi...
In DepthDetails PubMed
TargetCruzipain(Trypanosoma cruzi)
Universidad De Buenos Aires
Curated by ChEMBL
LigandPNGBDBM50356187(CHEMBL1269725)
Affinity DataIC50:  1.05E+5nM. Assay description: Inhibition of epimastigote form of Trypanosoma cruzi Tulahuen 2 cruzain assessed as reduction in 7-amino-4-methylcoumarin release incubated for 20 mi...
In DepthDetails PubMed
TargetUrease(Canavalia ensiformis (Jack bean) (Horse bean))
Comsats Institute Of Information Technology
Curated by ChEMBL
LigandPNGBDBM50356187(CHEMBL1269725)
Affinity DataIC50:  670nM. Assay description: Inhibition of jack bean urease assessed as ammonia production after 30 mins by indophenol method
In DepthDetails ArticlePubMed