BDBM50356194 CHEMBL499789
SMILES COc1cc(C=NNC(N)=S)cc(OC)c1OC
InChI Key InChIKey=DMATYSZHGOMQEH-UHFFFAOYSA-N
Data  1 KI  1 IC50
  Tab Delimited (TSV)   2D SDfile   Computed 3D by Vconf -m prep SDfile
Find this compound or compounds like it in BindingDB:
Activity Spreadsheet -- Enzyme Inhibition Constant Data from BindingDB
Found 2 hits for monomerid = 50356194
TargetUrease(Canavalia ensiformis (Jack bean) (Horse bean))
Comsats Institute Of Information Technology
Curated by ChEMBL
LigandPNGBDBM50356194(CHEMBL499789)
Affinity DataKi:  910nM. Assay description: Inhibition of jack bean urease assessed as ammonia production after 30 mins by indophenol method
In DepthDetails ArticlePubMed
TargetUrease(Canavalia ensiformis (Jack bean) (Horse bean))
Comsats Institute Of Information Technology
Curated by ChEMBL
LigandPNGBDBM50356194(CHEMBL499789)
Affinity DataIC50:  989nM. Assay description: Inhibition of jack bean urease assessed as ammonia production after 30 mins by indophenol method
In DepthDetails ArticlePubMed