BDBM50356202 CHEMBL1910225
SMILES CC=CC=NNC(N)=S
InChI Key InChIKey=OWTTWSQTSRNFHY-UHFFFAOYSA-N
Data  1 KI  1 IC50
  Tab Delimited (TSV)   2D SDfile   Computed 3D by Vconf -m prep SDfile
Find this compound or compounds like it in BindingDB:
Activity Spreadsheet -- Enzyme Inhibition Constant Data from BindingDB
Found 2 hits for monomerid = 50356202
TargetUrease(Canavalia ensiformis (Jack bean) (Horse bean))
Comsats Institute Of Information Technology
Curated by ChEMBL
LigandPNGBDBM50356202(CHEMBL1910225)
Affinity DataKi:  430nM. Assay description: Inhibition of jack bean urease assessed as ammonia production after 30 mins by indophenol method
In DepthDetails ArticlePubMed
TargetUrease(Canavalia ensiformis (Jack bean) (Horse bean))
Comsats Institute Of Information Technology
Curated by ChEMBL
LigandPNGBDBM50356202(CHEMBL1910225)
Affinity DataIC50:  746nM. Assay description: Inhibition of jack bean urease assessed as ammonia production after 30 mins by indophenol method
In DepthDetails ArticlePubMed