BDBM50356543 CHEMBL1909851
SMILES CCc1c(nn(c1-n1c(C)ccc1C)-c1ccc(Cl)cc1Cl)C(=O)NCc1ccc(Cl)c(Cl)c1
InChI Key InChIKey=HBHMIKJVZYVGNO-UHFFFAOYSA-N
Data  2 KI
  Tab Delimited (TSV)   2D SDfile   Computed 3D by Vconf -m prep SDfile
Find this compound or compounds like it in BindingDB:
Activity Spreadsheet -- Enzyme Inhibition Constant Data from BindingDB
Found 2 hits for monomerid = 50356543
TargetCannabinoid receptor 1(Homo sapiens (Human))
Sapienza University Of Rome
Curated by ChEMBL
LigandPNGBDBM50356543(CHEMBL1909851)
Affinity DataKi:  53.1nM. Assay description: Displacement of [3H]CP-55,940 from recombinant human CB1 receptor expressed in HEK cells
In DepthDetails ArticlePubMed
TargetCannabinoid receptor 2(Homo sapiens (Human))
Sapienza University Of Rome
Curated by ChEMBL
LigandPNGBDBM50356543(CHEMBL1909851)
Affinity DataKi:  56.1nM. Assay description: Displacement of [3H]CP-55,940 from recombinant human CB2 receptor expressed in HEK cells
In DepthDetails ArticlePubMed