BDBM50356545 CHEMBL1909853
SMILES CCc1ccc(CC)n1-c1c(C)c(nn1-c1ccc(Cl)c(Cl)c1)C(=O)NCc1ccc(Cl)c(Cl)c1
InChI Key InChIKey=VMWZOMOQEMJIMP-UHFFFAOYSA-N
Data  2 KI
  Tab Delimited (TSV)   2D SDfile   Computed 3D by Vconf -m prep SDfile
Find this compound or compounds like it in BindingDB:
Activity Spreadsheet -- Enzyme Inhibition Constant Data from BindingDB
Found 2 hits for monomerid = 50356545
TargetCannabinoid receptor 2(Homo sapiens (Human))
Sapienza University Of Rome
Curated by ChEMBL
LigandPNGBDBM50356545(CHEMBL1909853)
Affinity DataKi: >1.00E+4nM. Assay description: Displacement of [3H]CP-55,940 from recombinant human CB2 receptor expressed in HEK cells
In DepthDetails ArticlePubMed
TargetCannabinoid receptor 1(Homo sapiens (Human))
Sapienza University Of Rome
Curated by ChEMBL
LigandPNGBDBM50356545(CHEMBL1909853)
Affinity DataKi: >1.00E+4nM. Assay description: Displacement of [3H]CP-55,940 from recombinant human CB1 receptor expressed in HEK cells
In DepthDetails ArticlePubMed