BDBM50357206 CHEMBL1915083::CHEMBL1962378
SMILES OC(COc1ccccc1C(=O)CCc1ccccc1)CN1CCN(CC1)C(c1ccccc1)c1ccccc1
InChI Key InChIKey=YRDBYJNFZJBXNY-UHFFFAOYSA-N
Data  2 IC50
  Tab Delimited (TSV)   2D SDfile   Computed 3D by Vconf -m prep SDfile
Find this compound or compounds like it in BindingDB:
Activity Spreadsheet -- Enzyme Inhibition Constant Data from BindingDB
Found 2 hits for monomerid = 50357206
TargetPotassium voltage-gated channel subfamily H member 2(Homo sapiens (Human))
St. Jude Children'S Research Hospital
Curated by ChEMBL
LigandPNGBDBM50357206(CHEMBL1915083 | CHEMBL1962378)
Affinity DataIC50:  2.60E+3nM. Assay description: Inhibition of human ERG by patch clamp assay
In DepthDetails ArticlePubMed
TargetPotassium voltage-gated channel subfamily H member 2(Homo sapiens (Human))
St. Jude Children'S Research Hospital
Curated by ChEMBL
LigandPNGBDBM50357206(CHEMBL1915083 | CHEMBL1962378)
Affinity DataIC50:  2.60E+3nM. Assay description: Inhibition of human cloned ERG channel expressed in chinese hamster CHO cells after 5 mins by patch clamp assay
In DepthDetails ArticlePubMed