BDBM50357755 CHEMBL1916193
SMILES CC(C)[C@H]1CN(Cc2ccccc2C(F)(F)F)CCN1c1ccc(cc1)C(=O)NS(=O)(=O)c1ccc(N[C@H](CCN(C)C)CSc2ccccc2)c(c1)[N+]([O-])=O
InChI Key InChIKey=GIKGILWDETZVHR-XWDCEDKXSA-N
Data  3 KI
  Tab Delimited (TSV)   2D SDfile   Computed 3D by Vconf -m prep SDfile
Find this compound or compounds like it in BindingDB:
Activity Spreadsheet -- Enzyme Inhibition Constant Data from BindingDB
Found 3 hits for monomerid = 50357755
TargetBcl-2-like protein 1(Homo sapiens (Human))
University Of Washington
Curated by ChEMBL
LigandPNGBDBM50357755(CHEMBL1916193)
Affinity DataKi:  3.30nM. Assay description: Displacement of BODIPY-Bak conjugated peptide from GST-tagged human Wild type Bcl-2-like protein 1 expressed in Escherichia coli BL21 cells at 10 uM ...
In DepthDetails ArticlePubMed
TargetBcl-2-like protein 2(Homo sapiens (Human))
University Of Washington
Curated by ChEMBL
LigandPNGBDBM50357755(CHEMBL1916193)
Affinity DataKi:  59nM. Assay description: Displacement of BODIPY-Bak conjugated peptide from GST-tagged human wild type Bcl-W expressed in Escherichia coli BL21 cells at 10 uM after 3 hrs by ...
In DepthDetails ArticlePubMed
TargetInduced myeloid leukemia cell differentiation protein Mcl-1 homolog(Mus musculus (Mouse))
University Of Washington
Curated by ChEMBL
LigandPNGBDBM50357755(CHEMBL1916193)
Affinity DataKi:  2.00E+3nM. Assay description: Displacement of BODIPY-Bak conjugated peptide from GST-tagged mouse wild type MCL1 expressed in Escherichia coli BL21 cells at 10 uM after 3 hrs by f...
In DepthDetails ArticlePubMed