BDBM50358162 CHEMBL1921851
SMILES CC1(C)CN(Cc2ccc(Oc3ccc(cn3)C(N)=O)cc2)[C@H]1c1ccccc1
InChI Key InChIKey=SANDEZFLUQQASO-QFIPXVFZSA-N
Data  3 KI
  Tab Delimited (TSV)   2D SDfile   Computed 3D by Vconf -m prep SDfile
Find this compound or compounds like it in BindingDB:
Activity Spreadsheet -- Enzyme Inhibition Constant Data from BindingDB
Found 3 hits for monomerid = 50358162
TargetKappa-type opioid receptor(Homo sapiens (Human))
Eli Lilly
Curated by ChEMBL
LigandPNGBDBM50358162(CHEMBL1921851)
Affinity DataKi:  27nM. Assay description: Displacement of [3H]diprenorphine from human opioid kappa receptor expressed in CHO cells after 120 mins by scintillation counting
In DepthDetails ArticlePubMed
TargetMu-type opioid receptor(Homo sapiens (Human))
Eli Lilly
Curated by ChEMBL
LigandPNGBDBM50358162(CHEMBL1921851)
Affinity DataKi:  107nM. Assay description: Displacement of [3H]diprenorphine from human opioid mu receptor expressed in CHO cells after 120 mins by scintillation counting
In DepthDetails ArticlePubMed
TargetDelta-type opioid receptor(Homo sapiens (Human))
Eli Lilly
Curated by ChEMBL
LigandPNGBDBM50358162(CHEMBL1921851)
Affinity DataKi: >500nM. Assay description: Displacement of [3H]diprenorphine from human opioid delta receptor expressed in HEK293 cells after 120 mins by scintillation counting
In DepthDetails ArticlePubMed