BDBM50358233 CHEMBL1922207
SMILES CC[C@H](Nc1nc(NCc2ccccn2)c2ncn(C(C)C)c2n1)C(O)C(C)(C)C
InChI Key InChIKey=PGZQBZCWIHOLGU-ATNAJCNCSA-N
Data  3 IC50
  Tab Delimited (TSV)   2D SDfile   Computed 3D by Vconf -m prep SDfile
Find this compound or compounds like it in BindingDB:
Activity Spreadsheet -- Enzyme Inhibition Constant Data from BindingDB
Found 3 hits for monomerid = 50358233
TargetCyclin-H/Cyclin-dependent kinase 7(Homo sapiens (Human))
The Institute Of Cancer Research
Curated by ChEMBL
LigandPNGBDBM50358233(CHEMBL1922207)
Affinity DataIC50:  5.80E+3nM. Assay description: Inhibition of CDK7/cyclin H
In DepthDetails ArticlePubMed
TargetCyclin-dependent kinase/G2/mitotic-specific cyclin- 1(Homo sapiens (Human))
The Institute Of Cancer Research
Curated by ChEMBL
LigandPNGBDBM50358233(CHEMBL1922207)
Affinity DataIC50:  2.00E+5nM. Assay description: Inhibition of CDK1/cyclin B
In DepthDetails ArticlePubMed
TargetMitogen-activated protein kinase 1(Homo sapiens (Human))
The Institute Of Cancer Research
Curated by ChEMBL
LigandPNGBDBM50358233(CHEMBL1922207)
Affinity DataIC50:  1.37E+5nM. Assay description: Inhibition of ERK2
In DepthDetails ArticlePubMed