BDBM50358960 CHEMBL1923774
SMILES CCCCCCC(C)(C)c1cc(O)cc(OCCCCCCCCCCCCOC(CO)CO)c1
InChI Key InChIKey=GQLZRJXYCSFWNA-UHFFFAOYSA-N
Data  2 KI
  Tab Delimited (TSV)   2D SDfile   Computed 3D by Vconf -m prep SDfile
Find this compound or compounds like it in BindingDB:
Activity Spreadsheet -- Enzyme Inhibition Constant Data from BindingDB
Found 2 hits for monomerid = 50358960
TargetCannabinoid receptor 1(Homo sapiens (Human))
Universit£
Curated by ChEMBL
LigandPNGBDBM50358960(CHEMBL1923774)
Affinity DataKi:  1.04E+3nM. Assay description: Displacement of [3H]CP55940 from human CB1 receptor expressed in human HEK293 cells
In DepthDetails ArticlePubMed
TargetCannabinoid receptor 2(Homo sapiens (Human))
Universit£
Curated by ChEMBL
LigandPNGBDBM50358960(CHEMBL1923774)
Affinity DataKi:  1.67E+3nM. Assay description: Displacement of [3H]CP55940 from human CB2 receptor expressed in human HEK293 cells
In DepthDetails ArticlePubMed