BDBM50359315 CHEMBL1929194
SMILES C[C@@H]1O[C@@H](Oc2cc(O)c3c(c2)oc(-c2ccc(O)cc2)c(O[C@H]2OC[C@@](O)(CO)[C@@H]2O)c3=O)[C@H](O)[C@H](O)[C@H]1O
InChI Key InChIKey=SVQKJHRWPYLYKM-IFHXNFKFSA-N
Data  1 IC50
  Tab Delimited (TSV)   2D SDfile   Computed 3D by Vconf -m prep SDfile
Find this compound or compounds like it in BindingDB:
Activity Spreadsheet -- Enzyme Inhibition Constant Data from BindingDB
Found 1 hit for monomerid = 50359315
TargetDNA topoisomerase 2-alpha(Homo sapiens (Human))
University Of Thessaly
Curated by ChEMBL
LigandPNGBDBM50359315(CHEMBL1929194)
Affinity DataIC50:  5.50E+5nM. Assay description: Inhibition of human topoisomerase 2-mediated relation of supercoiled DNA after 60 mins
In DepthDetails ArticlePubMed