BDBM50359407 CHEMBL1926719
SMILES CCOC(=O)Nc1cc(NCCN(CC)CC)c2nc(-c3cccs3)c(nc2n1)-c1cccs1
InChI Key InChIKey=WURFFRHAMZEZAK-UHFFFAOYSA-N
Data  1 IC50
  Tab Delimited (TSV)   2D SDfile   Computed 3D by Vconf -m prep SDfile
Find this compound or compounds like it in BindingDB:
Activity Spreadsheet -- Enzyme Inhibition Constant Data from BindingDB
Found 1 hit for monomerid = 50359407
TargetCell division protein FtsZ(Mycobacterium tuberculosis)
Southern Research Institute
Curated by ChEMBL
LigandPNGBDBM50359407(CHEMBL1926719)
Affinity DataIC50:  2.10E+4nM. Assay description: Inhibition of Mycobacterium tuberculosis FtsZ polymerization expressed in Escherichia coli by light scattering assay
In DepthDetails ArticlePubMed