BDBM50359869 CHEMBL1929094
SMILES CSc1ccc(COCC#CC(O)c2cccc(c2)[N+]([O-])=O)cc1
InChI Key InChIKey=UXAFZMDWBSYVLT-UHFFFAOYSA-N
Data  1 IC50
  Tab Delimited (TSV)   2D SDfile   Computed 3D by Vconf -m prep SDfile
Find this compound or compounds like it in BindingDB:
Activity Spreadsheet -- Enzyme Inhibition Constant Data from BindingDB
Found 1 hit for monomerid = 50359869
TargetPolyunsaturated fatty acid 5-lipoxygenase(Homo sapiens (Human))
University Of Hyderabad
Curated by ChEMBL
LigandPNGBDBM50359869(CHEMBL1929094)
Affinity DataIC50:  6.20E+4nM. Assay description: Inhibition of 5-LOX assessed as decrease in oxygen concentration using arachidonic acid as substrate by polarigraphic method with Clark's oxygen elec...
In DepthDetails ArticlePubMed