BDBM50362675 CHEMBL1939620
SMILES Cn1c(OCC(C)(C)C(N)=O)nnc1-c1ccc(NC(=O)c2ccc3ccccc3c2)cc1
InChI Key InChIKey=XCGQTUKHPMKZBO-UHFFFAOYSA-N
Data  2 IC50
  Tab Delimited (TSV)   2D SDfile   Computed 3D by Vconf -m prep SDfile
Find this compound or compounds like it in BindingDB:
Activity Spreadsheet -- Enzyme Inhibition Constant Data from BindingDB
Found 2 hits for monomerid = 50362675
TargetDiacylglycerol O-acyltransferase 1(Homo sapiens (Human))
Prosidion
Curated by ChEMBL
LigandPNGBDBM50362675(CHEMBL1939620)
Affinity DataIC50:  28nM. Assay description: Inhibition of human recombinant N-terminus FLAG-tagged DGAT1 expressed in baculovirus infected insect Sf9 cells assessed as triglyceride synthesis
In DepthDetails ArticlePubMed
TargetDiacylglycerol O-acyltransferase 1(Mus musculus (mouse))
Prosidion
Curated by ChEMBL
LigandPNGBDBM50362675(CHEMBL1939620)
Affinity DataIC50:  6.10E+3nM. Assay description: Inhibition of DGAT1-mediated triglyceride synthesis n mouse 3T3L1 cells
In DepthDetails ArticlePubMed