BDBM50363319 CHEMBL1945849
SMILES Cc1cccc(n1)-n1nc(C)c(cc1=O)-c1ccc(OC2CCN(CC2)C2CCC2)cc1
InChI Key InChIKey=YOBFYQPQJKTEBG-UHFFFAOYSA-N
Data  2 KI  1 IC50
  Tab Delimited (TSV)   2D SDfile   Computed 3D by Vconf -m prep SDfile
Find this compound or compounds like it in BindingDB:
Activity Spreadsheet -- Enzyme Inhibition Constant Data from BindingDB
Found 3 hits for monomerid = 50363319
TargetHistamine H3 receptor(Homo sapiens (Human))
Cephalon
Curated by ChEMBL
LigandPNGBDBM50363319(CHEMBL1945849)
Affinity DataKi:  4nM. Assay description: Displacement of [3H]N-alpha-methylhistamine from human histamine H3 receptor expressed in CHO cells
In DepthDetails ArticlePubMed
TargetHistamine H3 receptor(Rattus norvegicus (rat))
Cephalon
Curated by ChEMBL
LigandPNGBDBM50363319(CHEMBL1945849)
Affinity DataKi:  10nM. Assay description: Displacement of [3H]N-alpha-methylhistamine from rat histamine H3 receptor expressed in CHO cells
In DepthDetails ArticlePubMed
TargetPotassium voltage-gated channel subfamily H member 2(Homo sapiens (Human))
Cephalon
Curated by ChEMBL
LigandPNGBDBM50363319(CHEMBL1945849)
Affinity DataIC50: >3.00E+4nM. Assay description: Inhibition of human ERG by patch clamp assay
In DepthDetails ArticlePubMed