BDBM50363516 CHEMBL1946093
SMILES CCCN(CCC)C(=O)C1CCCc2c1c1ccccc1n2CCF
InChI Key InChIKey=PCAVTEZGSYPHGB-UHFFFAOYSA-N
Data  1 KI
  Tab Delimited (TSV)   2D SDfile   Computed 3D by Vconf -m prep SDfile
Find this compound or compounds like it in BindingDB:
Activity Spreadsheet -- Enzyme Inhibition Constant Data from BindingDB
Found 1 hit for monomerid = 50363516
TargetTranslocator protein(Rattus norvegicus (rat))
Ge Healthcare
Curated by ChEMBL
LigandPNGBDBM50363516(CHEMBL1946093)
Affinity DataKi:  0.700nM. Assay description: Displacement of [3H]PK11195 from TSPO receptor in Wistar rat heart homogenate after 15 mins
In DepthDetails ArticlePubMed