BDBM50364067 CHEMBL4175983
SMILES CCC(CC)O[C@@H]1C=C(C[C@H](NCc2ccc(cc2)N2CCCC2)[C@H]1NC(C)=O)C(O)=O
InChI Key InChIKey=MVOJTTLXXQHARV-RBZQAINGSA-N
Data  12 IC50
  Tab Delimited (TSV)   2D SDfile   Computed 3D by Vconf -m prep SDfile
Find this compound or compounds like it in BindingDB:
Activity Spreadsheet -- Enzyme Inhibition Constant Data from BindingDB
Found 12 hits for monomerid = 50364067
TargetNeuraminidase(Influenza A virus)
Shandong University
Curated by ChEMBL
LigandPNGBDBM50364067(CHEMBL4175983)
Affinity DataIC50:  6.5nM. Assay description: Inhibition of Influenza A virus (A/Anhui/1/2013(H7N9)) neuraminidase activity using 4-MUNANA as substrate preincubated for 10 mins followed by substr...
In DepthDetails ArticlePubMed
TargetNeuraminidase(Influenza A virus)
Shandong University
Curated by ChEMBL
LigandPNGBDBM50364067(CHEMBL4175983)
Affinity DataIC50:  14nM. Assay description: Inhibition of Influenza A virus (A/goose/Guangdong/SH7/2013(H5N1)) neuraminidase activity using 4-MUNANA as substrate preincubated for 10 mins follow...
In DepthDetails ArticlePubMed
TargetNeuraminidase(Influenza A virus)
Shandong University
Curated by ChEMBL
LigandPNGBDBM50364067(CHEMBL4175983)
Affinity DataIC50:  2.10nM. Assay description: Inhibition of Influenza A virus (A/chicken/china/415/2013(H9N2)) neuraminidase activity using 4-MUNANA as substrate preincubated for 10 mins followed...
In DepthDetails ArticlePubMed
TargetNeuraminidase(Influenza A virus)
Shandong University
Curated by ChEMBL
LigandPNGBDBM50364067(CHEMBL4175983)
Affinity DataIC50:  2.30nM. Assay description: Inhibition of Influenza A virus (A/California/04/2009(H1N1)) neuraminidase activity using 4-MUNANA as substrate preincubated for 10 mins followed by ...
In DepthDetails ArticlePubMed
TargetNeuraminidase(Influenza A virus)
Shandong University
Curated by ChEMBL
LigandPNGBDBM50364067(CHEMBL4175983)
Affinity DataIC50:  1.80nM. Assay description: Inhibition of Influenza A virus (A/Babol/36/2005(H3N2)) neuraminidase activity using 4-MUNANA as substrate preincubated for 10 mins followed by subst...
In DepthDetails ArticlePubMed
TargetNeuraminidase(Influenza A virus)
Shandong University
Curated by ChEMBL
LigandPNGBDBM50364067(CHEMBL4175983)
Affinity DataIC50:  11nM. Assay description: Inhibition of Influenza A virus (A/duck/Guangdong/674/2014(H5N6)) neuraminidase activity using 4-MUNANA as substrate preincubated for 10 mins followe...
In DepthDetails ArticlePubMed
TargetNeuraminidase(Influenza A virus (A/Puerto Rico/8/34/Mount Sinai(...)
Shandong University
Curated by ChEMBL
LigandPNGBDBM50364067(CHEMBL4175983)
Affinity DataIC50:  2.70nM. Assay description: Inhibition of Influenza A virus (A/PuertoRico/8/1934(H1N1)) neuraminidase activity using 4-MUNANA as substrate preincubated for 10 mins followed by s...
In DepthDetails ArticlePubMed
TargetNeuraminidase(Influenza A virus)
Shandong University
Curated by ChEMBL
LigandPNGBDBM50364067(CHEMBL4175983)
Affinity DataIC50:  4.10nM. Assay description: Inhibition of Influenza A virus (A/goose/Jiangsu/1306/2014(H5N8)) neuraminidase activity using 4-MUNANA as substrate preincubated for 10 mins followe...
In DepthDetails ArticlePubMed
TargetNeuraminidase(Influenza A virus)
Shandong University
Curated by ChEMBL
LigandPNGBDBM50364067(CHEMBL4175983)
Affinity DataIC50:  664nM. Assay description: Inhibition of Influenza A virus (A/Anhui/1/2005(H5N1)) neuraminidase H274Y mutant activity using 4-MUNANA as substrate preincubated for 10 mins follo...
In DepthDetails ArticlePubMed
TargetNeuraminidase(Influenza A virus)
Shandong University
Curated by ChEMBL
LigandPNGBDBM50364067(CHEMBL4175983)
Affinity DataIC50:  289nM. Assay description: Inhibition of Influenza A virus (A/Babol/36/2005(H3N2)) neuraminidase E119V mutant activity using 4-MUNANA as substrate preincubated for 10 mins foll...
In DepthDetails ArticlePubMed
TargetNeuraminidase(Influenza B virus (B/Lee/40))
Shandong University
Curated by ChEMBL
LigandPNGBDBM50364067(CHEMBL4175983)
Affinity DataIC50:  86nM. Assay description: Inhibition of Influenza B virus neuraminidase activity using 4-MUNANA as substrate preincubated for 10 mins followed by substrate addition and measur...
In DepthDetails ArticlePubMed
TargetNeuraminidase(Influenza A virus)
Shandong University
Curated by ChEMBL
LigandPNGBDBM50364067(CHEMBL4175983)
Affinity DataIC50:  4.5nM. Assay description: Inhibition of Influenza A virus (A/Chicken/Hebei/LZF/2014(H5N2)) neuraminidase activity using 4-MUNANA as substrate preincubated for 10 mins followed...
In DepthDetails ArticlePubMed