BDBM50364307 CHEMBL1949759
SMILES O=S(=O)(c1ccccc1)c1ccc2[C@@H]3CCNC[C@@H]3Oc2c1
InChI Key InChIKey=XQMQGYSMGFFZSH-RDJZCZTQSA-N
Data  1 KI
  Tab Delimited (TSV)   2D SDfile   Computed 3D by Vconf -m prep SDfile
Find this compound or compounds like it in BindingDB:
Activity Spreadsheet -- Enzyme Inhibition Constant Data from BindingDB
Found 1 hit for monomerid = 50364307
Target5-hydroxytryptamine receptor 6(Homo sapiens (Human))
Cephalon
Curated by ChEMBL
LigandPNGBDBM50364307(CHEMBL1949759)
Affinity DataKi:  83nM. Assay description: Displacement of [3H]LSD from human recombinant 5HT6 receptor
In DepthDetails ArticlePubMed