BDBM50364315 CHEMBL1949767
SMILES COc1cccc(c1)S(=O)(=O)c1ccc2[C@@H]3CCNC[C@@H]3Oc2c1
InChI Key InChIKey=OAQFMIPANPFIIZ-WMZOPIPTSA-N
Data  1 KI  1 IC50
  Tab Delimited (TSV)   2D SDfile   Computed 3D by Vconf -m prep SDfile
Find this compound or compounds like it in BindingDB:
Activity Spreadsheet -- Enzyme Inhibition Constant Data from BindingDB
Found 2 hits for monomerid = 50364315
Target5-hydroxytryptamine receptor 6(Homo sapiens (Human))
Cephalon
Curated by ChEMBL
LigandPNGBDBM50364315(CHEMBL1949767)
Affinity DataKi:  85nM. Assay description: Displacement of [3H]LSD from human recombinant 5HT6 receptor
In DepthDetails ArticlePubMed
Target5-hydroxytryptamine receptor 6(Homo sapiens (Human))
Cephalon
Curated by ChEMBL
LigandPNGBDBM50364315(CHEMBL1949767)
Affinity DataIC50:  281nM. Assay description: Antagonist activity at human 5HT6 receptor expressed in human astrocytoma cells assessed as inhibition of cAMP production
In DepthDetails ArticlePubMed