BDBM50365223 CHEMBL1956470
SMILES CCOc1nc2nc(C)cc(Nc3cccc(Cl)c3)n2n1
InChI Key InChIKey=HDNFEZSIQRFFIC-UHFFFAOYSA-N
Data  1 IC50
  Tab Delimited (TSV)   2D SDfile   Computed 3D by Vconf -m prep SDfile
Find this compound or compounds like it in BindingDB:
Activity Spreadsheet -- Enzyme Inhibition Constant Data from BindingDB
Found 1 hit for monomerid = 50365223
TargetDihydroorotate dehydrogenase (quinone), mitochondrial(Homo sapiens (Human))
Glaxosmithkline
Curated by ChEMBL
LigandPNGBDBM50365223(CHEMBL1956470)
Affinity DataIC50: >1.00E+5nM. Assay description: Inhibition of human C-terminal hexa-His tagged DHODH expressed in Escherichia coli by DCIP reduction assay
In DepthDetails ArticlePubMed