BDBM50366027 CHEMBL1956461
SMILES O[C@@H]1Cc2cc([nH]c2C[C@H]1N1CCC(CC1)c1ccccc1)C(=O)c1ccc(F)cc1
InChI Key InChIKey=GMUIIXHFDSJPCW-JWQCQUIFSA-N
Data  1 KI
  Tab Delimited (TSV)   2D SDfile   Computed 3D by Vconf -m prep SDfile
Find this compound or compounds like it in BindingDB:
Activity Spreadsheet -- Enzyme Inhibition Constant Data from BindingDB
Found 1 hit for monomerid = 50366027
TargetVesicular acetylcholine transporter(Rattus norvegicus)
Institute Of Radiopharmacy
Curated by ChEMBL
LigandPNGBDBM50366027(CHEMBL1956461)
Affinity DataKi:  312nM. Assay description: Displacement of (-)-[3H]vesamicol from rat VAchT transfected in rat PC12 cells after 2 hrs by scintillation counting
In DepthDetails ArticlePubMed