BDBM50366752 CHEMBL1793970
SMILES CC[C@H](C)[C@@H]1NC(=O)[C@H](NC(=O)[C@H](CCCCCC(=O)CC)NC(=O)[C@H]2CCCCN2C1=O)c1cnc2ccccc2c1O
InChI Key InChIKey=PTHPLNHMLCUQHG-XKELZNELSA-N
Data  1 KI
  Tab Delimited (TSV)   2D SDfile   Computed 3D by Vconf -m prep SDfile
Find this compound or compounds like it in BindingDB:
Activity Spreadsheet -- Enzyme Inhibition Constant Data from BindingDB
Found 1 hit for monomerid = 50366752
TargetHistone deacetylase(Cryptosporidium parvum)
Merck Research Laboratories
Curated by ChEMBL
LigandPNGBDBM50366752(CHEMBL1793970)
Affinity DataKi:  250nM. Assay description: Binding affinity towards HDAC enzyme derived from Eimeria tenella protozoa
In DepthDetails ArticlePubMed